{"text_format":"1","workbook":"xlsx","n_sheets":12,"sheets":["Readme 1st","Tarefas","Team","List","Dashboard","Planilha1","M1_Template","Meetings_View","M1_Template (4)","M1_Template (3)","M1_Template (2)","eTask_ScratchCharts"],"not_rendered":{"charts":2,"images":17,"macros":1,"external_links":0,"defined_names":5,"comments":0,"pivot_tables":0},"unopened":[],"bounds":{"document_bytes":16777216,"sheet_cells":100000,"rows_first":2000,"rows_last":500,"rows_between":2000,"halvings":0,"cell_chars":16384,"cell_head_chars":4096},"cells_cut":0,"cells_raw":0,"read":"whole","date_system":"1900"}

{"sheet":"Readme 1st","index":0,"n_rows":0,"n_cols":0,"rows_kept":0,"cut":false,"hidden":false,"merged":[]}

{"sheet":"Tarefas","index":1,"n_rows":101,"n_cols":10,"rows_kept":101,"cut":false,"hidden":false,"merged":[]}
["ID","Title","Assignee","Prioridade","Status","Start Date","Due Date","Progress","Project","Notes"]
[1,"Optimize pricing page copy","John Miller","Medium","In Progress","2025-07-02","2026-07-07",0.45,"Product","Add a clear success criterion and owner."]
[2,"Follow up on demo early-discount payment link","Hans Müller","Medium","In Progress","2025-07-11","2026-07-31",0.85,"Finance","Verify in GA4 DebugView with debug_mode enabled."]
[3,"Validate invoice reconciliation sheet","Emily Johnson","Medium","In Progress","2025-07-05","2026-07-16",0.75,"Finance","Numbers don’t match last month’s report."]
[4,"Ship demo download flow","Anna Schneider","High","In Progress","2025-06-19","2026-07-02",0.35,"Product","High priority due to upcoming demo traffic."]
[5,"Update customer onboarding checklist","Michael Brown","Medium","In Progress","2025-07-27","2026-08-20",0.6,"Support","Include steps for non-technical users."]
[6,"Implement CSV export edge cases","Lukas Weber","Low","Completed","2025-07-10","2026-07-24",1,"Data","Two edge cases still failing."]
[7,"Review cookie banner compliance text","Sarah Williams","Medium","In Progress","2025-06-16","2026-06-21",0.7,"Legal","Align with legal/compliance before publishing."]
[8,"Fix landing page mobile layout","Laura Fischer","High","In Progress","2025-06-29","2026-07-20",0.55000000000000004,"Web","Needs screenshots from latest build."]
[9,"Investigate dashboard load-time bottleneck","David Anderson","High","In Progress","2025-08-06","2026-08-18",0.4,"Data","Customer reported inconsistent behavior."]
[10,"Prepare sprint planning backlog","Thomas Becker","Medium","Completed","2025-06-28","2026-07-19",1,"Product","Waiting for stakeholder sign-off."]
[11,"Finalize release notes for v1.4","Jessica Taylor","Medium","In Progress","2025-06-30","2026-07-22",0.8,"Product","Keep terminology consistent with UI labels."]
[12,"Test email template branding","Sophie Wagner","Medium","In Progress","2025-06-25","2026-07-06",0.9,"Web","Re-test needed after last hotfix."]
[13,"Clean up data import deduplication","Robert Davis","High","In Progress","2025-06-13","2026-06-22",0.5,"Data","Numbers don’t match last month’s report."]
[14,"Review GA4 event naming conventions","Daniel Hoffmann","High","In Progress","2025-08-09","2026-09-02",0.35,"Marketing","Verify in GA4 DebugView with debug_mode enabled."]
[15,"Configure error logging alert thresholds","Amanda Wilson","Medium","In Progress","2025-05-25","2026-06-13",0.55000000000000004,"Infrastructure","Too many false alarms at night."]
[16,"Refactor support macro responses","Christian Lehmann","Low","In Progress","2025-05-24","2026-06-06",0.3,"Support","Include steps for non-technical users."]
[17,"Update feature request shortlist","Andrew Walker","Medium","Completed","2025-05-30","2025-06-26",1,"Product","Add a clear success criterion and owner."]
[18,"Prepare A/B test hypothesis doc","Jan Richter","Medium","In Progress","2025-06-06","2026-06-10",0.15,"Marketing","Limit scope to 1-page change to ship on time."]
[19,"Fix checkout tracking event mapping","Nicole Hall","High","In Progress","2025-08-18","2026-09-08",0.99,"Finance","Verify in GA4 DebugView with debug_mode enabled."]
[20,"Validate role-based access permissions","Oliver Meier","Medium","In Progress","2025-07-02","2026-07-17",0.7,"Security","Align with legal/compliance before publishing."]
[21,"Implement backup restore procedure","Justin Scott","High","In Progress","2025-06-29","2026-07-20",0.75,"Data","Re-test needed after last hotfix."]
[22,"Write vendor contract clause changes","Megan Robinson","Low","In Progress","2025-06-20","2026-06-06",0.3,"Legal","Waiting for stakeholder sign-off."]
[23,"Optimize SEO meta descriptions","Benjamin Krüger","Low","In Progress","2025-07-14","2026-06-06",0.3,"Web","Confirm translation consistency (EN/DE)."]
[24,"Investigate demo download flow","Florian Brandt","Low","In Progress","2025-06-23","2026-06-06",0.3,"Product","High priority due to upcoming demo traffic."]
[25,"Finalize refund policy text","Patrick Neumann","High","In Progress","2025-08-29","2025-09-03",0.85,"Legal","Align with legal/compliance before publishing."]
[26,"Update knowledge base category structure","Stephanie King","Low","In Progress","2025-08-18","2025-09-08",0.35,"Support","Content duplicated in several sections."]
[27,"Test CSV export edge cases","Tobias Sommer","Low","In Progress","2025-06-16","2026-07-17",0.6,"Data","Two edge cases still failing."]
[28,"Review checkout tracking event mapping","Ryan Young","Low","In Progress","2025-07-06","2026-08-01",0.55000000000000004,"Finance","Verify in GA4 DebugView with debug_mode enabled."]
[29,"Implement demo early-discount payment link","Lukas Weber","Low","To Do","2025-06-15","2025-07-14",0,"Finance","Waiting for stakeholder sign-off."]
[30,"Analyze marketing audience exclusions","Emily Johnson","Medium","In Progress","2025-08-06","2025-08-25",0.45,"Marketing","Remove low-quality placements."]
[31,"Document backup restore procedure","Daniel Lewis","Medium","In Progress","2025-06-18","2025-07-04",0.8,"Data","Include steps for non-technical users."]
[32,"Fix error logging alert thresholds","Julia Klein","High","In Progress","2025-07-01","2025-07-09",0.9,"Infrastructure","Too many false alarms at night."]
[33,"Prepare team training deck","Kevin Harris","Medium","In Progress","2025-05-19","2025-06-23",0.25,"HR","Needs screenshots from latest build."]
[34,"Refactor demo download flow","Anna Schneider","Medium","In Progress","2025-08-06","2025-08-28",0.55000000000000004,"Product","Customer reported inconsistent behavior."]
[35,"Validate invoice reconciliation sheet","Hans Müller","High","Completed","2025-08-18","2025-08-20",1,"Finance","Numbers don’t match last month’s report."]
[36,"Update GA4 event naming conventions","Jessica Taylor","Medium","In Progress","2025-06-19","2025-07-11",0.65,"Marketing","Keep terminology consistent with UI labels."]
[37,"Fix landing page mobile layout","John Miller","Medium","Canceled","2025-05-25","2025-06-13",0.3,"Web","Blocked by vendor response."]
[38,"Investigate dashboard load-time bottleneck","Markus Schäfer","High","In Progress","2025-08-05","2025-08-19",0.75,"Data","Customer reported inconsistent behavior."]
[39,"Prepare sprint planning backlog","Christopher Moore","Medium","In Progress","2025-06-30","2025-07-05",0.15,"Product","Add a clear success criterion and owner."]
{"$rows_left_out":62}
{"sheet":"Team","index":2,"n_rows":41,"n_cols":2,"rows_kept":41,"cut":false,"hidden":false,"merged":[]}
["Full Name","Email"]
["John Miller","john.miller@damfus.com"]
["Hans Müller","hans.mueller@damfus.com"]
["Emily Johnson","emily.johnson@damfus.com"]
["Anna Schneider","anna.schneider@damfus.com"]
["Michael Brown","michael.brown@damfus.com"]
["Lukas Weber","lukas.weber@damfus.com"]
["Sarah Williams","sarah.williams@damfus.com"]
["Laura Fischer","laura.fischer@damfus.com"]
["David Anderson","david.anderson@damfus.com"]
["Thomas Becker","thomas.becker@damfus.com"]
["Jessica Taylor","jessica.taylor@damfus.com"]
["Sophie Wagner","sophie.wagner@damfus.com"]
["Robert Davis","robert.davis@damfus.com"]
["Daniel Hoffmann","daniel.hoffmann@damfus.com"]
["Amanda Wilson","amanda.wilson@damfus.com"]
["Julia Klein","julia.klein@damfus.com"]
["Christopher Moore","christopher.moore@damfus.com"]
["Markus Schäfer","markus.schaefer@damfus.com"]
["Ashley Thompson","ashley.thompson@damfus.com"]
["Felix Braun","felix.braun@damfus.com"]
["Brian Martinez","brian.martinez@damfus.com"]
["Nina König","nina.koenig@damfus.com"]
["Kevin Harris","kevin.harris@damfus.com"]
["Sebastian Wolf","sebastian.wolf@damfus.com"]
["Laura Clark","laura.clark@damfus.com"]
["Patrick Neumann","patrick.neumann@damfus.com"]
["Daniel Lewis","daniel.lewis@damfus.com"]
["Katharina Vogel","katharina.vogel@damfus.com"]
["Megan Robinson","megan.robinson@damfus.com"]
["Jan Richter","jan.richter@damfus.com"]
["Andrew Walker","andrew.walker@damfus.com"]
["Tobias Sommer","tobias.sommer@damfus.com"]
["Nicole Hall","nicole.hall@damfus.com"]
["Florian Brandt","florian.brandt@damfus.com"]
["Ryan Young","ryan.young@damfus.com"]
["Oliver Meier","oliver.meier@damfus.com"]
["Stephanie King","stephanie.king@damfus.com"]
["Christian Lehmann","christian.lehmann@damfus.com"]
["Justin Scott","justin.scott@damfus.com"]
{"$rows_left_out":2}
{"sheet":"List","index":3,"n_rows":5,"n_cols":2,"rows_kept":5,"cut":false,"hidden":true,"merged":[]}
["Priority","Status"]
["Low","To Do"]
["Medium","In Progress"]
["High","Completed"]
[null,"Canceled"]

{"sheet":"Dashboard","index":4,"n_rows":100,"n_cols":8,"rows_kept":100,"cut":false,"hidden":true,"merged":[]}
["Status","Number of Tasks",null,"Assignee","Number of Tasks",null,"Project Name","Average Progress (%)"]
["To Do",{"$f":"COUNTIF(Tarefas!E:E,A2)","v":12},null,{"$f":"IFERROR(INDEX(Tarefas!$C$2:$C$891,SMALL(IF(ISERROR(MATCH(Tarefas!$C$2:$C$891,D$1:D1,0))*(Tarefas!$C$2:$C$891<>\"\"),ROW(Tarefas!$C$2:$C$891)-ROW(Tarefas!#REF!)+1),1)),\"\")","v":""},{"$f":"IF(D2=\"\",\"\",COUNTIF(Tarefas!C:C,D2))","v":""},null,"Projeto A",{"$f":"AVERAGEIF(Tarefas!I:I, G2, Tarefas!H:H)","v":{"$error":"#DIV/0!"}}]
["In Progress",{"$f":"COUNTIF(Tarefas!E:E,A3)","v":74},null,{"$f":"IFERROR(INDEX(Tarefas!$C$2:$C$891,SMALL(IF(ISERROR(MATCH(Tarefas!$C$2:$C$891,D$1:D2,0))*(Tarefas!$C$2:$C$891<>\"\"),ROW(Tarefas!$C$2:$C$891)-ROW(Tarefas!#REF!)+1),1)),\"\")","v":""},{"$f":"IF(D3=\"\",\"\",COUNTIF(Tarefas!C:C,D3))","v":""},null,"Projeto B",{"$f":"AVERAGEIF(Tarefas!I:I, G3, Tarefas!H:H)","v":{"$error":"#DIV/0!"}}]
["Completed",{"$f":"COUNTIF(Tarefas!E:E,A4)","v":13},null,{"$f":"IFERROR(INDEX(Tarefas!$C$2:$C$891,SMALL(IF(ISERROR(MATCH(Tarefas!$C$2:$C$891,D$1:D3,0))*(Tarefas!$C$2:$C$891<>\"\"),ROW(Tarefas!$C$2:$C$891)-ROW(Tarefas!#REF!)+1),1)),\"\")","v":""},{"$f":"IF(D4=\"\",\"\",COUNTIF(Tarefas!C:C,D4))","v":""},null,"Projeto C",{"$f":"AVERAGEIF(Tarefas!I:I, G4, Tarefas!H:H)","v":{"$error":"#DIV/0!"}}]
["Canceled",null,null,{"$f":"IFERROR(INDEX(Tarefas!$C$2:$C$891,SMALL(IF(ISERROR(MATCH(Tarefas!$C$2:$C$891,D$1:D4,0))*(Tarefas!$C$2:$C$891<>\"\"),ROW(Tarefas!$C$2:$C$891)-ROW(Tarefas!#REF!)+1),1)),\"\")","v":""},{"$f":"IF(D5=\"\",\"\",COUNTIF(Tarefas!C:C,D5))","v":""}]
[null,null,null,{"$f":"IFERROR(INDEX(Tarefas!$C$2:$C$891,SMALL(IF(ISERROR(MATCH(Tarefas!$C$2:$C$891,D$1:D5,0))*(Tarefas!$C$2:$C$891<>\"\"),ROW(Tarefas!$C$2:$C$891)-ROW(Tarefas!#REF!)+1),1)),\"\")","v":""},{"$f":"IF(D6=\"\",\"\",COUNTIF(Tarefas!C:C,D6))","v":""}]
[null,null,null,{"$f":"IFERROR(INDEX(Tarefas!$C$2:$C$891,SMALL(IF(ISERROR(MATCH(Tarefas!$C$2:$C$891,D$1:D6,0))*(Tarefas!$C$2:$C$891<>\"\"),ROW(Tarefas!$C$2:$C$891)-ROW(Tarefas!#REF!)+1),1)),\"\")","v":""},{"$f":"IF(D7=\"\",\"\",COUNTIF(Tarefas!C:C,D7))","v":""}]
[null,null,null,{"$f":"IFERROR(INDEX(Tarefas!$C$2:$C$891,SMALL(IF(ISERROR(MATCH(Tarefas!$C$2:$C$891,D$1:D7,0))*(Tarefas!$C$2:$C$891<>\"\"),ROW(Tarefas!$C$2:$C$891)-ROW(Tarefas!#REF!)+1),1)),\"\")","v":""},{"$f":"IF(D8=\"\",\"\",COUNTIF(Tarefas!C:C,D8))","v":""}]
[null,null,null,{"$f":"IFERROR(INDEX(Tarefas!$C$2:$C$891,SMALL(IF(ISERROR(MATCH(Tarefas!$C$2:$C$891,D$1:D8,0))*(Tarefas!$C$2:$C$891<>\"\"),ROW(Tarefas!$C$2:$C$891)-ROW(Tarefas!#REF!)+1),1)),\"\")","v":""},{"$f":"IF(D9=\"\",\"\",COUNTIF(Tarefas!C:C,D9))","v":""}]
[null,null,null,{"$f":"IFERROR(INDEX(Tarefas!$C$2:$C$891,SMALL(IF(ISERROR(MATCH(Tarefas!$C$2:$C$891,D$1:D9,0))*(Tarefas!$C$2:$C$891<>\"\"),ROW(Tarefas!$C$2:$C$891)-ROW(Tarefas!#REF!)+1),1)),\"\")","v":""},{"$f":"IF(D10=\"\",\"\",COUNTIF(Tarefas!C:C,D10))","v":""}]
[null,null,null,{"$f":"IFERROR(INDEX(Tarefas!$C$2:$C$891,SMALL(IF(ISERROR(MATCH(Tarefas!$C$2:$C$891,D$1:D10,0))*(Tarefas!$C$2:$C$891<>\"\"),ROW(Tarefas!$C$2:$C$891)-ROW(Tarefas!#REF!)+1),1)),\"\")","v":""},{"$f":"IF(D11=\"\",\"\",COUNTIF(Tarefas!C:C,D11))","v":""}]
[null,null,null,{"$f":"IFERROR(INDEX(Tarefas!$C$2:$C$891,SMALL(IF(ISERROR(MATCH(Tarefas!$C$2:$C$891,D$1:D11,0))*(Tarefas!$C$2:$C$891<>\"\"),ROW(Tarefas!$C$2:$C$891)-ROW(Tarefas!#REF!)+1),1)),\"\")","v":""},{"$f":"IF(D12=\"\",\"\",COUNTIF(Tarefas!C:C,D12))","v":""}]
[null,null,null,{"$f":"IFERROR(INDEX(Tarefas!$C$2:$C$891,SMALL(IF(ISERROR(MATCH(Tarefas!$C$2:$C$891,D$1:D12,0))*(Tarefas!$C$2:$C$891<>\"\"),ROW(Tarefas!$C$2:$C$891)-ROW(Tarefas!#REF!)+1),1)),\"\")","v":""},{"$f":"IF(D13=\"\",\"\",COUNTIF(Tarefas!C:C,D13))","v":""}]
[null,null,null,{"$f":"IFERROR(INDEX(Tarefas!$C$2:$C$891,SMALL(IF(ISERROR(MATCH(Tarefas!$C$2:$C$891,D$1:D13,0))*(Tarefas!$C$2:$C$891<>\"\"),ROW(Tarefas!$C$2:$C$891)-ROW(Tarefas!#REF!)+1),1)),\"\")","v":""},{"$f":"IF(D14=\"\",\"\",COUNTIF(Tarefas!C:C,D14))","v":""}]
[null,null,null,{"$f":"IFERROR(INDEX(Tarefas!$C$2:$C$891,SMALL(IF(ISERROR(MATCH(Tarefas!$C$2:$C$891,D$1:D14,0))*(Tarefas!$C$2:$C$891<>\"\"),ROW(Tarefas!$C$2:$C$891)-ROW(Tarefas!#REF!)+1),1)),\"\")","v":""},{"$f":"IF(D15=\"\",\"\",COUNTIF(Tarefas!C:C,D15))","v":""}]
[null,null,null,{"$f":"IFERROR(INDEX(Tarefas!$C$2:$C$891,SMALL(IF(ISERROR(MATCH(Tarefas!$C$2:$C$891,D$1:D15,0))*(Tarefas!$C$2:$C$891<>\"\"),ROW(Tarefas!$C$2:$C$891)-ROW(Tarefas!#REF!)+1),1)),\"\")","v":""},{"$f":"IF(D16=\"\",\"\",COUNTIF(Tarefas!C:C,D16))","v":""}]
[null,null,null,{"$f":"IFERROR(INDEX(Tarefas!$C$2:$C$891,SMALL(IF(ISERROR(MATCH(Tarefas!$C$2:$C$891,D$1:D16,0))*(Tarefas!$C$2:$C$891<>\"\"),ROW(Tarefas!$C$2:$C$891)-ROW(Tarefas!#REF!)+1),1)),\"\")","v":""},{"$f":"IF(D17=\"\",\"\",COUNTIF(Tarefas!C:C,D17))","v":""}]
[null,null,null,{"$f":"IFERROR(INDEX(Tarefas!$C$2:$C$891,SMALL(IF(ISERROR(MATCH(Tarefas!$C$2:$C$891,D$1:D17,0))*(Tarefas!$C$2:$C$891<>\"\"),ROW(Tarefas!$C$2:$C$891)-ROW(Tarefas!#REF!)+1),1)),\"\")","v":""},{"$f":"IF(D18=\"\",\"\",COUNTIF(Tarefas!C:C,D18))","v":""}]
[null,null,null,{"$f":"IFERROR(INDEX(Tarefas!$C$2:$C$891,SMALL(IF(ISERROR(MATCH(Tarefas!$C$2:$C$891,D$1:D18,0))*(Tarefas!$C$2:$C$891<>\"\"),ROW(Tarefas!$C$2:$C$891)-ROW(Tarefas!#REF!)+1),1)),\"\")","v":""},{"$f":"IF(D19=\"\",\"\",COUNTIF(Tarefas!C:C,D19))","v":""}]
[null,null,null,{"$f":"IFERROR(INDEX(Tarefas!$C$2:$C$891,SMALL(IF(ISERROR(MATCH(Tarefas!$C$2:$C$891,D$1:D19,0))*(Tarefas!$C$2:$C$891<>\"\"),ROW(Tarefas!$C$2:$C$891)-ROW(Tarefas!#REF!)+1),1)),\"\")","v":""},{"$f":"IF(D20=\"\",\"\",COUNTIF(Tarefas!C:C,D20))","v":""}]
[null,null,null,{"$f":"IFERROR(INDEX(Tarefas!$C$2:$C$891,SMALL(IF(ISERROR(MATCH(Tarefas!$C$2:$C$891,D$1:D20,0))*(Tarefas!$C$2:$C$891<>\"\"),ROW(Tarefas!$C$2:$C$891)-ROW(Tarefas!#REF!)+1),1)),\"\")","v":""},{"$f":"IF(D21=\"\",\"\",COUNTIF(Tarefas!C:C,D21))","v":""}]
[null,null,null,{"$f":"IFERROR(INDEX(Tarefas!$C$2:$C$891,SMALL(IF(ISERROR(MATCH(Tarefas!$C$2:$C$891,D$1:D21,0))*(Tarefas!$C$2:$C$891<>\"\"),ROW(Tarefas!$C$2:$C$891)-ROW(Tarefas!#REF!)+1),1)),\"\")","v":""},{"$f":"IF(D22=\"\",\"\",COUNTIF(Tarefas!C:C,D22))","v":""}]
[null,null,null,{"$f":"IFERROR(INDEX(Tarefas!$C$2:$C$891,SMALL(IF(ISERROR(MATCH(Tarefas!$C$2:$C$891,D$1:D22,0))*(Tarefas!$C$2:$C$891<>\"\"),ROW(Tarefas!$C$2:$C$891)-ROW(Tarefas!#REF!)+1),1)),\"\")","v":""},{"$f":"IF(D23=\"\",\"\",COUNTIF(Tarefas!C:C,D23))","v":""}]
[null,null,null,{"$f":"IFERROR(INDEX(Tarefas!$C$2:$C$891,SMALL(IF(ISERROR(MATCH(Tarefas!$C$2:$C$891,D$1:D23,0))*(Tarefas!$C$2:$C$891<>\"\"),ROW(Tarefas!$C$2:$C$891)-ROW(Tarefas!#REF!)+1),1)),\"\")","v":""},{"$f":"IF(D24=\"\",\"\",COUNTIF(Tarefas!C:C,D24))","v":""}]
[null,null,null,{"$f":"IFERROR(INDEX(Tarefas!$C$2:$C$891,SMALL(IF(ISERROR(MATCH(Tarefas!$C$2:$C$891,D$1:D24,0))*(Tarefas!$C$2:$C$891<>\"\"),ROW(Tarefas!$C$2:$C$891)-ROW(Tarefas!#REF!)+1),1)),\"\")","v":""},{"$f":"IF(D25=\"\",\"\",COUNTIF(Tarefas!C:C,D25))","v":""}]
[null,null,null,{"$f":"IFERROR(INDEX(Tarefas!$C$2:$C$891,SMALL(IF(ISERROR(MATCH(Tarefas!$C$2:$C$891,D$1:D25,0))*(Tarefas!$C$2:$C$891<>\"\"),ROW(Tarefas!$C$2:$C$891)-ROW(Tarefas!#REF!)+1),1)),\"\")","v":""},{"$f":"IF(D26=\"\",\"\",COUNTIF(Tarefas!C:C,D26))","v":""}]
[null,null,null,{"$f":"IFERROR(INDEX(Tarefas!$C$2:$C$891,SMALL(IF(ISERROR(MATCH(Tarefas!$C$2:$C$891,D$1:D26,0))*(Tarefas!$C$2:$C$891<>\"\"),ROW(Tarefas!$C$2:$C$891)-ROW(Tarefas!#REF!)+1),1)),\"\")","v":""},{"$f":"IF(D27=\"\",\"\",COUNTIF(Tarefas!C:C,D27))","v":""}]
[null,null,null,{"$f":"IFERROR(INDEX(Tarefas!$C$2:$C$891,SMALL(IF(ISERROR(MATCH(Tarefas!$C$2:$C$891,D$1:D27,0))*(Tarefas!$C$2:$C$891<>\"\"),ROW(Tarefas!$C$2:$C$891)-ROW(Tarefas!#REF!)+1),1)),\"\")","v":""},{"$f":"IF(D28=\"\",\"\",COUNTIF(Tarefas!C:C,D28))","v":""}]
[null,null,null,{"$f":"IFERROR(INDEX(Tarefas!$C$2:$C$891,SMALL(IF(ISERROR(MATCH(Tarefas!$C$2:$C$891,D$1:D28,0))*(Tarefas!$C$2:$C$891<>\"\"),ROW(Tarefas!$C$2:$C$891)-ROW(Tarefas!#REF!)+1),1)),\"\")","v":""},{"$f":"IF(D29=\"\",\"\",COUNTIF(Tarefas!C:C,D29))","v":""}]
[null,null,null,{"$f":"IFERROR(INDEX(Tarefas!$C$2:$C$891,SMALL(IF(ISERROR(MATCH(Tarefas!$C$2:$C$891,D$1:D29,0))*(Tarefas!$C$2:$C$891<>\"\"),ROW(Tarefas!$C$2:$C$891)-ROW(Tarefas!#REF!)+1),1)),\"\")","v":""},{"$f":"IF(D30=\"\",\"\",COUNTIF(Tarefas!C:C,D30))","v":""}]
[null,null,null,{"$f":"IFERROR(INDEX(Tarefas!$C$2:$C$891,SMALL(IF(ISERROR(MATCH(Tarefas!$C$2:$C$891,D$1:D30,0))*(Tarefas!$C$2:$C$891<>\"\"),ROW(Tarefas!$C$2:$C$891)-ROW(Tarefas!#REF!)+1),1)),\"\")","v":""},{"$f":"IF(D31=\"\",\"\",COUNTIF(Tarefas!C:C,D31))","v":""}]
[null,null,null,{"$f":"IFERROR(INDEX(Tarefas!$C$2:$C$891,SMALL(IF(ISERROR(MATCH(Tarefas!$C$2:$C$891,D$1:D31,0))*(Tarefas!$C$2:$C$891<>\"\"),ROW(Tarefas!$C$2:$C$891)-ROW(Tarefas!#REF!)+1),1)),\"\")","v":""},{"$f":"IF(D32=\"\",\"\",COUNTIF(Tarefas!C:C,D32))","v":""}]
[null,null,null,{"$f":"IFERROR(INDEX(Tarefas!$C$2:$C$891,SMALL(IF(ISERROR(MATCH(Tarefas!$C$2:$C$891,D$1:D32,0))*(Tarefas!$C$2:$C$891<>\"\"),ROW(Tarefas!$C$2:$C$891)-ROW(Tarefas!#REF!)+1),1)),\"\")","v":""},{"$f":"IF(D33=\"\",\"\",COUNTIF(Tarefas!C:C,D33))","v":""}]
[null,null,null,{"$f":"IFERROR(INDEX(Tarefas!$C$2:$C$891,SMALL(IF(ISERROR(MATCH(Tarefas!$C$2:$C$891,D$1:D33,0))*(Tarefas!$C$2:$C$891<>\"\"),ROW(Tarefas!$C$2:$C$891)-ROW(Tarefas!#REF!)+1),1)),\"\")","v":""},{"$f":"IF(D34=\"\",\"\",COUNTIF(Tarefas!C:C,D34))","v":""}]
[null,null,null,{"$f":"IFERROR(INDEX(Tarefas!$C$2:$C$891,SMALL(IF(ISERROR(MATCH(Tarefas!$C$2:$C$891,D$1:D34,0))*(Tarefas!$C$2:$C$891<>\"\"),ROW(Tarefas!$C$2:$C$891)-ROW(Tarefas!#REF!)+1),1)),\"\")","v":""},{"$f":"IF(D35=\"\",\"\",COUNTIF(Tarefas!C:C,D35))","v":""}]
[null,null,null,{"$f":"IFERROR(INDEX(Tarefas!$C$2:$C$891,SMALL(IF(ISERROR(MATCH(Tarefas!$C$2:$C$891,D$1:D35,0))*(Tarefas!$C$2:$C$891<>\"\"),ROW(Tarefas!$C$2:$C$891)-ROW(Tarefas!#REF!)+1),1)),\"\")","v":""},{"$f":"IF(D36=\"\",\"\",COUNTIF(Tarefas!C:C,D36))","v":""}]
[null,null,null,{"$f":"IFERROR(INDEX(Tarefas!$C$2:$C$891,SMALL(IF(ISERROR(MATCH(Tarefas!$C$2:$C$891,D$1:D36,0))*(Tarefas!$C$2:$C$891<>\"\"),ROW(Tarefas!$C$2:$C$891)-ROW(Tarefas!#REF!)+1),1)),\"\")","v":""},{"$f":"IF(D37=\"\",\"\",COUNTIF(Tarefas!C:C,D37))","v":""}]
[null,null,null,{"$f":"IFERROR(INDEX(Tarefas!$C$2:$C$891,SMALL(IF(ISERROR(MATCH(Tarefas!$C$2:$C$891,D$1:D37,0))*(Tarefas!$C$2:$C$891<>\"\"),ROW(Tarefas!$C$2:$C$891)-ROW(Tarefas!#REF!)+1),1)),\"\")","v":""},{"$f":"IF(D38=\"\",\"\",COUNTIF(Tarefas!C:C,D38))","v":""}]
[null,null,null,{"$f":"IFERROR(INDEX(Tarefas!$C$2:$C$891,SMALL(IF(ISERROR(MATCH(Tarefas!$C$2:$C$891,D$1:D38,0))*(Tarefas!$C$2:$C$891<>\"\"),ROW(Tarefas!$C$2:$C$891)-ROW(Tarefas!#REF!)+1),1)),\"\")","v":""},{"$f":"IF(D39=\"\",\"\",COUNTIF(Tarefas!C:C,D39))","v":""}]
[null,null,null,{"$f":"IFERROR(INDEX(Tarefas!$C$2:$C$891,SMALL(IF(ISERROR(MATCH(Tarefas!$C$2:$C$891,D$1:D39,0))*(Tarefas!$C$2:$C$891<>\"\"),ROW(Tarefas!$C$2:$C$891)-ROW(Tarefas!#REF!)+1),1)),\"\")","v":""},{"$f":"IF(D40=\"\",\"\",COUNTIF(Tarefas!C:C,D40))","v":""}]
{"$rows_left_out":61}
{"sheet":"Planilha1","index":5,"n_rows":0,"n_cols":0,"rows_kept":0,"cut":false,"hidden":true,"merged":[]}

{"sheet":"M1_Template","index":6,"n_rows":18,"n_cols":1,"rows_kept":18,"cut":false,"hidden":true,"merged":[[0,0,0,9],[2,0,5,9],[17,0,17,8]]}
["{{TITLE}}"]
[]
["{{SUMMARY}}"]
[]
[]
[]
[]
[]
[]
[]
[]
[]
[]
[]
[]
[]
[]
["{{TABLE}}"]

{"sheet":"Meetings_View","index":7,"n_rows":10,"n_cols":10,"rows_kept":10,"cut":false,"hidden":true,"merged":[]}
["Col1","Col2","Col3","Col4","Col5","Col6","Col7","Col8","Col9","Col10"]
[5,"Ana Souza","Planejamento de release","2025-10-06","26/06/2025",0.76,"In Progress","Baixa","RH","Cliente solicitou ajustes."]
[26,"Ana Souza","Analisar incidentes","2025-05-08","28/08/2025",0.4,"In Progress","Baixa","Mobile","Dependência bloqueando tarefa."]
[34,"Ana Souza","Reunião com cliente 2153","16/06/2025","2025-10-07",0.84,"In Progress","Média","Financeiro","Aguardando aprovação do produto."]
[40,"Ana Souza","Refinar histórias 4574","13/07/2025","31/07/2025",0.3,"Canceled","Baixa","Financeiro","Tudo certo para avançar."]
[41,"Ana Souza","Follow‑up com fornecedor","25/07/2025","2025-02-08",0.43,"In Progress","Alta","RH","Necessita materiais de design."]
[43,"Ana Souza","Prototipar novas telas","29/05/2025","2025-11-06",1,"Completed","Média","Produto","Necessita materiais de design."]
[56,"Ana Souza","Refinar histórias","27/11/2025","2025-04-12",1,"Completed","Média","RH","Necessita materiais de design."]
[88,"Ana Souza","Planejamento de release 4145","2025-04-10","27/10/2025",0,"Canceled","Alta","Financeiro","Pendente retorno do fornecedor."]
[98,"Ana Souza","Alinhamento de orçamento","21/10/2025","2025-05-11",0.1,"To Do","Média","RH","Necessita materiais de design."]

{"sheet":"M1_Template (4)","index":8,"n_rows":18,"n_cols":1,"rows_kept":18,"cut":false,"hidden":true,"merged":[[0,0,0,9],[2,0,5,9],[17,0,17,8]]}
["{{TITLE}}"]
[]
["{{SUMMARY}}"]
[]
[]
[]
[]
[]
[]
[]
[]
[]
[]
[]
[]
[]
[]
["{{TABLE}}"]

{"sheet":"M1_Template (3)","index":9,"n_rows":18,"n_cols":1,"rows_kept":18,"cut":false,"hidden":true,"merged":[[0,0,0,9],[2,0,5,9],[17,0,17,8]]}
["{{TITLE}}"]
[]
["{{SUMMARY}}"]
[]
[]
[]
[]
[]
[]
[]
[]
[]
[]
[]
[]
[]
[]
["{{TABLE}}"]

{"sheet":"M1_Template (2)","index":10,"n_rows":18,"n_cols":1,"rows_kept":18,"cut":false,"hidden":true,"merged":[[0,0,0,9],[2,0,5,9],[17,0,17,8]]}
["{{TITLE}}"]
[]
["{{SUMMARY}}"]
[]
[]
[]
[]
[]
[]
[]
[]
[]
[]
[]
[]
[]
[]
["{{TABLE}}"]

{"sheet":"eTask_ScratchCharts","index":11,"n_rows":0,"n_cols":0,"rows_kept":0,"cut":false,"hidden":true,"merged":[]}